{"text_format":"1","workbook":"xlsx","n_sheets":7,"sheets":["Cover","1. Introduction","2. Inputs","3. Dashboard","Product age","Depreciation-Amortization","Data summary"],"not_rendered":{"charts":1,"images":2,"macros":1,"external_links":0,"defined_names":5,"comments":2,"pivot_tables":1},"unopened":[],"bounds":{"document_bytes":16777216,"sheet_cells":100000,"rows_first":2000,"rows_last":500,"rows_between":2000,"halvings":0,"cell_chars":16384,"cell_head_chars":4096},"cells_cut":0,"cells_raw":0,"read":"whole","date_system":"1900"}

{"sheet":"Cover","index":0,"n_rows":0,"n_cols":0,"rows_kept":0,"cut":false,"hidden":false,"merged":[]}

{"sheet":"1. Introduction","index":1,"n_rows":26,"n_cols":6,"rows_kept":26,"cut":false,"hidden":false,"merged":[[4,2,4,5],[5,2,8,8],[5,10,5,11],[6,10,6,11],[7,10,7,11],[8,10,8,11],[48,6,48,9],[15,2,16,8],[18,2,18,4],[19,2,21,8],[23,2,23,8],[25,2,26,4],[25,5,26,5]]}
[]
[]
[]
[]
[null,null,"WELCOME TO THE PaaS BUSINESS CASE TOOL"]
[null,null,"The purpose of this tool is to provide a financial forecasting workbook to assess the viability of your PaaS business model, intended as a support material in the initial stages of building a business model. This is done through simple calculations involving a few estimation inputs from the user to be able to: "]
[]
[]
{"$rows_left_out":19}
{"sheet":"2. Inputs","index":2,"n_rows":100,"n_cols":25,"rows_kept":100,"cut":false,"hidden":false,"merged":[[2,1,3,1],[2,3,3,3],[79,1,88,1],[92,1,97,1],[24,1,36,1],[5,1,20,1],[40,1,71,1]]}
[]
[]
[null,"STEP 1:",null,"Estimate revenue potential by adding agreement input values in the input cells. An overview of your entries on this sheet is available on the 3. Dashboard sheet, remember to hit the refresh button!"]
[]
[]
[null,"REVENUE",null,"Agreement input values","Inputs"]
[null,null,null,"Price per agreement (annual)"]
[null,null,null,"Cancelled agreements rate (%)"]
{"$rows_left_out":93}
{"sheet":"3. Dashboard","index":3,"n_rows":0,"n_cols":0,"rows_kept":0,"cut":false,"hidden":false,"merged":[]}

{"sheet":"Product age","index":4,"n_rows":15,"n_cols":22,"rows_kept":15,"cut":false,"hidden":true,"merged":[]}
["Lifetime",{"$f":"'2. Inputs'!$E$31","v":0},{"$f":"'2. Inputs'!$F$31","v":1},{"$f":"'2. Inputs'!$G$31","v":2},{"$f":"'2. Inputs'!$H$31","v":3},{"$f":"'2. Inputs'!$I$31","v":4},{"$f":"'2. Inputs'!$J$31","v":5},{"$f":"'2. Inputs'!$K$31","v":6},{"$f":"'2. Inputs'!$L$31","v":7},{"$f":"'2. Inputs'!$M$31","v":8},{"$f":"'2. Inputs'!$N$31","v":9},{"$f":"'2. Inputs'!$O$31","v":10},{"$f":"'2. Inputs'!$P$31","v":11},{"$f":"'2. Inputs'!$Q$31","v":12},{"$f":"'2. Inputs'!$R$31","v":13},{"$f":"'2. Inputs'!$S$31","v":14},{"$f":"'2. Inputs'!$T$31","v":15},{"$f":"'2. Inputs'!$U$31","v":16},{"$f":"'2. Inputs'!$V$31","v":17},{"$f":"'2. Inputs'!$W$31","v":18},{"$f":"'2. Inputs'!$X$31","v":19},{"$f":"'2. Inputs'!$Y$31","v":20}]
["Needed product lifetime",{"$f":"'2. Inputs'!E17*'2. Inputs'!$E26","v":0},{"$f":"'2. Inputs'!F17*'2. Inputs'!$E26","v":0},{"$f":"'2. Inputs'!G17*'2. Inputs'!$E26","v":0},{"$f":"'2. Inputs'!H17*'2. Inputs'!$E26","v":0},{"$f":"'2. Inputs'!I17*'2. Inputs'!$E26","v":0},{"$f":"'2. Inputs'!J17*'2. Inputs'!$E26","v":0},{"$f":"'2. Inputs'!K17*'2. Inputs'!$E26","v":0},{"$f":"'2. Inputs'!L17*'2. Inputs'!$E26","v":0},{"$f":"'2. Inputs'!M17*'2. Inputs'!$E26","v":0},{"$f":"'2. Inputs'!N17*'2. Inputs'!$E26","v":0},{"$f":"'2. Inputs'!O17*'2. Inputs'!$E26","v":0},{"$f":"'2. Inputs'!P17*'2. Inputs'!$E26","v":0},{"$f":"'2. Inputs'!Q17*'2. Inputs'!$E26","v":0},{"$f":"'2. Inputs'!R17*'2. Inputs'!$E26","v":0},{"$f":"'2. Inputs'!S17*'2. Inputs'!$E26","v":0},{"$f":"'2. Inputs'!T17*'2. Inputs'!$E26","v":0},{"$f":"'2. Inputs'!U17*'2. Inputs'!$E26","v":0},{"$f":"'2. Inputs'!V17*'2. Inputs'!$E26","v":0},{"$f":"'2. Inputs'!W17*'2. Inputs'!$E26","v":0},{"$f":"'2. Inputs'!X17*'2. Inputs'!$E26","v":0},{"$f":"'2. Inputs'!Y17*'2. Inputs'!$E26","v":0}]
["Created average product lifetime",{"$f":"'2. Inputs'!$E27*'2. Inputs'!E32","v":0},{"$f":"'2. Inputs'!$E27*'2. Inputs'!F32","v":0},{"$f":"'2. Inputs'!$E27*'2. Inputs'!G32","v":0},{"$f":"'2. Inputs'!$E27*'2. Inputs'!H32","v":0},{"$f":"'2. Inputs'!$E27*'2. Inputs'!I32","v":0},{"$f":"'2. Inputs'!$E27*'2. Inputs'!J32","v":0},{"$f":"'2. Inputs'!$E27*'2. Inputs'!K32","v":0},{"$f":"'2. Inputs'!$E27*'2. Inputs'!L32","v":0},{"$f":"'2. Inputs'!$E27*'2. Inputs'!M32","v":0},{"$f":"'2. Inputs'!$E27*'2. Inputs'!N32","v":0},{"$f":"'2. Inputs'!$E27*'2. Inputs'!O32","v":0},{"$f":"'2. Inputs'!$E27*'2. Inputs'!P32","v":0},{"$f":"'2. Inputs'!$E27*'2. Inputs'!Q32","v":0},{"$f":"'2. Inputs'!$E27*'2. Inputs'!R32","v":0},{"$f":"'2. Inputs'!$E27*'2. Inputs'!S32","v":0},{"$f":"'2. Inputs'!$E27*'2. Inputs'!T32","v":0},{"$f":"'2. Inputs'!$E27*'2. Inputs'!U32","v":0},{"$f":"'2. Inputs'!$E27*'2. Inputs'!V32","v":0},{"$f":"'2. Inputs'!$E27*'2. Inputs'!W32","v":0},{"$f":"'2. Inputs'!$E27*'2. Inputs'!X32","v":0},{"$f":"'2. Inputs'!$E27*'2. Inputs'!Y32","v":0}]
["Used product lifetime",{"$f":"'2. Inputs'!E17*'2. Inputs'!$E26","v":0},{"$f":"'2. Inputs'!F17*'2. Inputs'!$E26","v":0},{"$f":"'2. Inputs'!G17*'2. Inputs'!$E26","v":0},{"$f":"'2. Inputs'!H17*'2. Inputs'!$E26","v":0},{"$f":"'2. Inputs'!I17*'2. Inputs'!$E26","v":0},{"$f":"'2. Inputs'!J17*'2. Inputs'!$E26","v":0},{"$f":"'2. Inputs'!K17*'2. Inputs'!$E26","v":0},{"$f":"'2. Inputs'!L17*'2. Inputs'!$E26","v":0},{"$f":"'2. Inputs'!M17*'2. Inputs'!$E26","v":0},{"$f":"'2. Inputs'!N17*'2. Inputs'!$E26","v":0},{"$f":"'2. Inputs'!O17*'2. Inputs'!$E26","v":0},{"$f":"'2. Inputs'!P17*'2. Inputs'!$E26","v":0},{"$f":"'2. Inputs'!Q17*'2. Inputs'!$E26","v":0},{"$f":"'2. Inputs'!R17*'2. Inputs'!$E26","v":0},{"$f":"'2. Inputs'!S17*'2. Inputs'!$E26","v":0},{"$f":"'2. Inputs'!T17*'2. Inputs'!$E26","v":0},{"$f":"'2. Inputs'!U17*'2. Inputs'!$E26","v":0},{"$f":"'2. Inputs'!V17*'2. Inputs'!$E26","v":0},{"$f":"'2. Inputs'!W17*'2. Inputs'!$E26","v":0},{"$f":"'2. Inputs'!X17*'2. Inputs'!$E26","v":0},{"$f":"'2. Inputs'!Y17*'2. Inputs'!$E26","v":0}]
[]
["Available average product lifetime EoY",{"$f":"B3-B4+B13","v":0},{"$f":"B6+C3-C4+C13","v":0},0,0,0,0,0,0,0,0,0,0,0,0,0,0,0,0,0,0,0]
[]
["Needed products with lifetime left EoY",{"$f":"'2. Inputs'!E19*'2. Inputs'!$E26","v":0},{"$f":"'2. Inputs'!F19*'2. Inputs'!$E26","v":0},{"$f":"'2. Inputs'!G19*'2. Inputs'!$E26","v":0},{"$f":"'2. Inputs'!H19*'2. Inputs'!$E26","v":0},{"$f":"'2. Inputs'!I19*'2. Inputs'!$E26","v":0},{"$f":"'2. Inputs'!J19*'2. Inputs'!$E26","v":0},{"$f":"'2. Inputs'!K19*'2. Inputs'!$E26","v":0},{"$f":"'2. Inputs'!L19*'2. Inputs'!$E26","v":0},{"$f":"'2. Inputs'!M19*'2. Inputs'!$E26","v":0},{"$f":"'2. Inputs'!N19*'2. Inputs'!$E26","v":0},{"$f":"'2. Inputs'!O19*'2. Inputs'!$E26","v":0},{"$f":"'2. Inputs'!P19*'2. Inputs'!$E26","v":0},{"$f":"'2. Inputs'!Q19*'2. Inputs'!$E26","v":0},{"$f":"'2. Inputs'!R19*'2. Inputs'!$E26","v":0},{"$f":"'2. Inputs'!S19*'2. Inputs'!$E26","v":0},{"$f":"'2. Inputs'!T19*'2. Inputs'!$E26","v":0},{"$f":"'2. Inputs'!U19*'2. Inputs'!$E26","v":0},{"$f":"'2. Inputs'!V19*'2. Inputs'!$E26","v":0},{"$f":"'2. Inputs'!W19*'2. Inputs'!$E26","v":0},{"$f":"'2. Inputs'!X19*'2. Inputs'!$E26","v":0},{"$f":"'2. Inputs'!Y19*'2. Inputs'!$E26","v":0}]
{"$rows_left_out":8}
{"sheet":"Depreciation-Amortization","index":5,"n_rows":50,"n_cols":23,"rows_kept":50,"cut":false,"hidden":true,"merged":[[2,0,22,0],[28,0,48,0]]}
["Depreciation",null,{"$f":"'2. Inputs'!$E$31","v":0},{"$f":"'2. Inputs'!$F$31","v":1},{"$f":"'2. Inputs'!$G$31","v":2},{"$f":"'2. Inputs'!$H$31","v":3},{"$f":"'2. Inputs'!$I$31","v":4},{"$f":"'2. Inputs'!$J$31","v":5},{"$f":"'2. Inputs'!$K$31","v":6},{"$f":"'2. Inputs'!$L$31","v":7},{"$f":"'2. Inputs'!$M$31","v":8},{"$f":"'2. Inputs'!$N$31","v":9},{"$f":"'2. Inputs'!$O$31","v":10},{"$f":"'2. Inputs'!$P$31","v":11},{"$f":"'2. Inputs'!$Q$31","v":12},{"$f":"'2. Inputs'!$R$31","v":13},{"$f":"'2. Inputs'!$S$31","v":14},{"$f":"'2. Inputs'!$T$31","v":15},{"$f":"'2. Inputs'!$U$31","v":16},{"$f":"'2. Inputs'!$V$31","v":17},{"$f":"'2. Inputs'!$W$31","v":18},{"$f":"'2. Inputs'!$X$31","v":19},{"$f":"'2. Inputs'!$Y$31","v":20}]
[null,"New Products",{"$f":"'2. Inputs'!E$32","v":0},{"$f":"'2. Inputs'!F$32","v":0},{"$f":"'2. Inputs'!G$32","v":0},{"$f":"'2. Inputs'!H$32","v":0},{"$f":"'2. Inputs'!I$32","v":0},{"$f":"'2. Inputs'!J$32","v":0},{"$f":"'2. Inputs'!K$32","v":0},{"$f":"'2. Inputs'!L$32","v":0},{"$f":"'2. Inputs'!M$32","v":0},{"$f":"'2. Inputs'!N$32","v":0},{"$f":"'2. Inputs'!O$32","v":0},{"$f":"'2. Inputs'!P$32","v":0},{"$f":"'2. Inputs'!Q$32","v":0},{"$f":"'2. Inputs'!R$32","v":0},{"$f":"'2. Inputs'!S$32","v":0},{"$f":"'2. Inputs'!T$32","v":0},{"$f":"'2. Inputs'!U$32","v":0},{"$f":"'2. Inputs'!V$32","v":0},{"$f":"'2. Inputs'!W$32","v":0},{"$f":"'2. Inputs'!X$32","v":0},{"$f":"'2. Inputs'!Y$32","v":0}]
["Depreciated products",{"$f":"C1","v":0},{"$f":"IF(C$1-$B3='2. Inputs'!$E$54,-HLOOKUP('Depreciation-Amortization'!$B3,'Depreciation-Amortization'!$C$1:$W$2,2,FALSE),0)","v":0},{"$f":"IF(D$1-$B3='2. Inputs'!$E$54,-HLOOKUP('Depreciation-Amortization'!$B3,'Depreciation-Amortization'!$C$1:$W$2,2,FALSE),0)","v":0},{"$f":"IF(E$1-$B3='2. Inputs'!$E$54,-HLOOKUP('Depreciation-Amortization'!$B3,'Depreciation-Amortization'!$C$1:$W$2,2,FALSE),0)","v":0},{"$f":"IF(F$1-$B3='2. Inputs'!$E$54,-HLOOKUP('Depreciation-Amortization'!$B3,'Depreciation-Amortization'!$C$1:$W$2,2,FALSE),0)","v":0},{"$f":"IF(G$1-$B3='2. Inputs'!$E$54,-HLOOKUP('Depreciation-Amortization'!$B3,'Depreciation-Amortization'!$C$1:$W$2,2,FALSE),0)","v":0},{"$f":"IF(H$1-$B3='2. Inputs'!$E$54,-HLOOKUP('Depreciation-Amortization'!$B3,'Depreciation-Amortization'!$C$1:$W$2,2,FALSE),0)","v":0},{"$f":"IF(I$1-$B3='2. Inputs'!$E$54,-HLOOKUP('Depreciation-Amortization'!$B3,'Depreciation-Amortization'!$C$1:$W$2,2,FALSE),0)","v":0},{"$f":"IF(J$1-$B3='2. Inputs'!$E$54,-HLOOKUP('Depreciation-Amortization'!$B3,'Depreciation-Amortization'!$C$1:$W$2,2,FALSE),0)","v":0},{"$f":"IF(K$1-$B3='2. Inputs'!$E$54,-HLOOKUP('Depreciation-Amortization'!$B3,'Depreciation-Amortization'!$C$1:$W$2,2,FALSE),0)","v":0},{"$f":"IF(L$1-$B3='2. Inputs'!$E$54,-HLOOKUP('Depreciation-Amortization'!$B3,'Depreciation-Amortization'!$C$1:$W$2,2,FALSE),0)","v":0},{"$f":"IF(M$1-$B3='2. Inputs'!$E$54,-HLOOKUP('Depreciation-Amortization'!$B3,'Depreciation-Amortization'!$C$1:$W$2,2,FALSE),0)","v":0},{"$f":"IF(N$1-$B3='2. Inputs'!$E$54,-HLOOKUP('Depreciation-Amortization'!$B3,'Depreciation-Amortization'!$C$1:$W$2,2,FALSE),0)","v":0},{"$f":"IF(O$1-$B3='2. Inputs'!$E$54,-HLOOKUP('Depreciation-Amortization'!$B3,'Depreciation-Amortization'!$C$1:$W$2,2,FALSE),0)","v":0},{"$f":"IF(P$1-$B3='2. Inputs'!$E$54,-HLOOKUP('Depreciation-Amortization'!$B3,'Depreciation-Amortization'!$C$1:$W$2,2,FALSE),0)","v":0},{"$f":"IF(Q$1-$B3='2. Inputs'!$E$54,-HLOOKUP('Depreciation-Amortization'!$B3,'Depreciation-Amortization'!$C$1:$W$2,2,FALSE),0)","v":0},{"$f":"IF(R$1-$B3='2. Inputs'!$E$54,-HLOOKUP('Depreciation-Amortization'!$B3,'Depreciation-Amortization'!$C$1:$W$2,2,FALSE),0)","v":0},{"$f":"IF(S$1-$B3='2. Inputs'!$E$54,-HLOOKUP('Depreciation-Amortization'!$B3,'Depreciation-Amortization'!$C$1:$W$2,2,FALSE),0)","v":0},{"$f":"IF(T$1-$B3='2. Inputs'!$E$54,-HLOOKUP('Depreciation-Amortization'!$B3,'Depreciation-Amortization'!$C$1:$W$2,2,FALSE),0)","v":0},{"$f":"IF(U$1-$B3='2. Inputs'!$E$54,-HLOOKUP('Depreciation-Amortization'!$B3,'Depreciation-Amortization'!$C$1:$W$2,2,FALSE),0)","v":0},{"$f":"IF(V$1-$B3='2. Inputs'!$E$54,-HLOOKUP('Depreciation-Amortization'!$B3,'Depreciation-Amortization'!$C$1:$W$2,2,FALSE),0)","v":0},{"$f":"IF(W$1-$B3='2. Inputs'!$E$54,-HLOOKUP('Depreciation-Amortization'!$B3,'Depreciation-Amortization'!$C$1:$W$2,2,FALSE),0)","v":0}]
[null,{"$f":"B3+1","v":1},{"$f":"IF(C$1-$B4='2. Inputs'!$E$54,-HLOOKUP('Depreciation-Amortization'!$B4,'Depreciation-Amortization'!$C$1:$W$2,2,FALSE),0)","v":0},{"$f":"IF(D$1-$B4='2. Inputs'!$E$54,-HLOOKUP('Depreciation-Amortization'!$B4,'Depreciation-Amortization'!$C$1:$W$2,2,FALSE),0)","v":0},{"$f":"IF(E$1-$B4='2. Inputs'!$E$54,-HLOOKUP('Depreciation-Amortization'!$B4,'Depreciation-Amortization'!$C$1:$W$2,2,FALSE),0)","v":0},{"$f":"IF(F$1-$B4='2. Inputs'!$E$54,-HLOOKUP('Depreciation-Amortization'!$B4,'Depreciation-Amortization'!$C$1:$W$2,2,FALSE),0)","v":0},{"$f":"IF(G$1-$B4='2. Inputs'!$E$54,-HLOOKUP('Depreciation-Amortization'!$B4,'Depreciation-Amortization'!$C$1:$W$2,2,FALSE),0)","v":0},{"$f":"IF(H$1-$B4='2. Inputs'!$E$54,-HLOOKUP('Depreciation-Amortization'!$B4,'Depreciation-Amortization'!$C$1:$W$2,2,FALSE),0)","v":0},{"$f":"IF(I$1-$B4='2. Inputs'!$E$54,-HLOOKUP('Depreciation-Amortization'!$B4,'Depreciation-Amortization'!$C$1:$W$2,2,FALSE),0)","v":0},{"$f":"IF(J$1-$B4='2. Inputs'!$E$54,-HLOOKUP('Depreciation-Amortization'!$B4,'Depreciation-Amortization'!$C$1:$W$2,2,FALSE),0)","v":0},{"$f":"IF(K$1-$B4='2. Inputs'!$E$54,-HLOOKUP('Depreciation-Amortization'!$B4,'Depreciation-Amortization'!$C$1:$W$2,2,FALSE),0)","v":0},{"$f":"IF(L$1-$B4='2. Inputs'!$E$54,-HLOOKUP('Depreciation-Amortization'!$B4,'Depreciation-Amortization'!$C$1:$W$2,2,FALSE),0)","v":0},{"$f":"IF(M$1-$B4='2. Inputs'!$E$54,-HLOOKUP('Depreciation-Amortization'!$B4,'Depreciation-Amortization'!$C$1:$W$2,2,FALSE),0)","v":0},{"$f":"IF(N$1-$B4='2. Inputs'!$E$54,-HLOOKUP('Depreciation-Amortization'!$B4,'Depreciation-Amortization'!$C$1:$W$2,2,FALSE),0)","v":0},{"$f":"IF(O$1-$B4='2. Inputs'!$E$54,-HLOOKUP('Depreciation-Amortization'!$B4,'Depreciation-Amortization'!$C$1:$W$2,2,FALSE),0)","v":0},{"$f":"IF(P$1-$B4='2. Inputs'!$E$54,-HLOOKUP('Depreciation-Amortization'!$B4,'Depreciation-Amortization'!$C$1:$W$2,2,FALSE),0)","v":0},{"$f":"IF(Q$1-$B4='2. Inputs'!$E$54,-HLOOKUP('Depreciation-Amortization'!$B4,'Depreciation-Amortization'!$C$1:$W$2,2,FALSE),0)","v":0},{"$f":"IF(R$1-$B4='2. Inputs'!$E$54,-HLOOKUP('Depreciation-Amortization'!$B4,'Depreciation-Amortization'!$C$1:$W$2,2,FALSE),0)","v":0},{"$f":"IF(S$1-$B4='2. Inputs'!$E$54,-HLOOKUP('Depreciation-Amortization'!$B4,'Depreciation-Amortization'!$C$1:$W$2,2,FALSE),0)","v":0},{"$f":"IF(T$1-$B4='2. Inputs'!$E$54,-HLOOKUP('Depreciation-Amortization'!$B4,'Depreciation-Amortization'!$C$1:$W$2,2,FALSE),0)","v":0},{"$f":"IF(U$1-$B4='2. Inputs'!$E$54,-HLOOKUP('Depreciation-Amortization'!$B4,'Depreciation-Amortization'!$C$1:$W$2,2,FALSE),0)","v":0},{"$f":"IF(V$1-$B4='2. Inputs'!$E$54,-HLOOKUP('Depreciation-Amortization'!$B4,'Depreciation-Amortization'!$C$1:$W$2,2,FALSE),0)","v":0},{"$f":"IF(W$1-$B4='2. Inputs'!$E$54,-HLOOKUP('Depreciation-Amortization'!$B4,'Depreciation-Amortization'!$C$1:$W$2,2,FALSE),0)","v":0}]
[null,{"$f":"B4+1","v":2},{"$f":"IF(C$1-$B5='2. Inputs'!$E$54,-HLOOKUP('Depreciation-Amortization'!$B5,'Depreciation-Amortization'!$C$1:$W$2,2,FALSE),0)","v":0},{"$f":"IF(D$1-$B5='2. Inputs'!$E$54,-HLOOKUP('Depreciation-Amortization'!$B5,'Depreciation-Amortization'!$C$1:$W$2,2,FALSE),0)","v":0},{"$f":"IF(E$1-$B5='2. Inputs'!$E$54,-HLOOKUP('Depreciation-Amortization'!$B5,'Depreciation-Amortization'!$C$1:$W$2,2,FALSE),0)","v":0},{"$f":"IF(F$1-$B5='2. Inputs'!$E$54,-HLOOKUP('Depreciation-Amortization'!$B5,'Depreciation-Amortization'!$C$1:$W$2,2,FALSE),0)","v":0},{"$f":"IF(G$1-$B5='2. Inputs'!$E$54,-HLOOKUP('Depreciation-Amortization'!$B5,'Depreciation-Amortization'!$C$1:$W$2,2,FALSE),0)","v":0},{"$f":"IF(H$1-$B5='2. Inputs'!$E$54,-HLOOKUP('Depreciation-Amortization'!$B5,'Depreciation-Amortization'!$C$1:$W$2,2,FALSE),0)","v":0},{"$f":"IF(I$1-$B5='2. Inputs'!$E$54,-HLOOKUP('Depreciation-Amortization'!$B5,'Depreciation-Amortization'!$C$1:$W$2,2,FALSE),0)","v":0},{"$f":"IF(J$1-$B5='2. Inputs'!$E$54,-HLOOKUP('Depreciation-Amortization'!$B5,'Depreciation-Amortization'!$C$1:$W$2,2,FALSE),0)","v":0},{"$f":"IF(K$1-$B5='2. Inputs'!$E$54,-HLOOKUP('Depreciation-Amortization'!$B5,'Depreciation-Amortization'!$C$1:$W$2,2,FALSE),0)","v":0},{"$f":"IF(L$1-$B5='2. Inputs'!$E$54,-HLOOKUP('Depreciation-Amortization'!$B5,'Depreciation-Amortization'!$C$1:$W$2,2,FALSE),0)","v":0},{"$f":"IF(M$1-$B5='2. Inputs'!$E$54,-HLOOKUP('Depreciation-Amortization'!$B5,'Depreciation-Amortization'!$C$1:$W$2,2,FALSE),0)","v":0},{"$f":"IF(N$1-$B5='2. Inputs'!$E$54,-HLOOKUP('Depreciation-Amortization'!$B5,'Depreciation-Amortization'!$C$1:$W$2,2,FALSE),0)","v":0},{"$f":"IF(O$1-$B5='2. Inputs'!$E$54,-HLOOKUP('Depreciation-Amortization'!$B5,'Depreciation-Amortization'!$C$1:$W$2,2,FALSE),0)","v":0},{"$f":"IF(P$1-$B5='2. Inputs'!$E$54,-HLOOKUP('Depreciation-Amortization'!$B5,'Depreciation-Amortization'!$C$1:$W$2,2,FALSE),0)","v":0},{"$f":"IF(Q$1-$B5='2. Inputs'!$E$54,-HLOOKUP('Depreciation-Amortization'!$B5,'Depreciation-Amortization'!$C$1:$W$2,2,FALSE),0)","v":0},{"$f":"IF(R$1-$B5='2. Inputs'!$E$54,-HLOOKUP('Depreciation-Amortization'!$B5,'Depreciation-Amortization'!$C$1:$W$2,2,FALSE),0)","v":0},{"$f":"IF(S$1-$B5='2. Inputs'!$E$54,-HLOOKUP('Depreciation-Amortization'!$B5,'Depreciation-Amortization'!$C$1:$W$2,2,FALSE),0)","v":0},{"$f":"IF(T$1-$B5='2. Inputs'!$E$54,-HLOOKUP('Depreciation-Amortization'!$B5,'Depreciation-Amortization'!$C$1:$W$2,2,FALSE),0)","v":0},{"$f":"IF(U$1-$B5='2. Inputs'!$E$54,-HLOOKUP('Depreciation-Amortization'!$B5,'Depreciation-Amortization'!$C$1:$W$2,2,FALSE),0)","v":0},{"$f":"IF(V$1-$B5='2. Inputs'!$E$54,-HLOOKUP('Depreciation-Amortization'!$B5,'Depreciation-Amortization'!$C$1:$W$2,2,FALSE),0)","v":0},{"$f":"IF(W$1-$B5='2. Inputs'!$E$54,-HLOOKUP('Depreciation-Amortization'!$B5,'Depreciation-Amortization'!$C$1:$W$2,2,FALSE),0)","v":0}]
[null,3,{"$f":"IF(C$1-$B6='2. Inputs'!$E$54,-HLOOKUP('Depreciation-Amortization'!$B6,'Depreciation-Amortization'!$C$1:$W$2,2,FALSE),0)","v":0},{"$f":"IF(D$1-$B6='2. Inputs'!$E$54,-HLOOKUP('Depreciation-Amortization'!$B6,'Depreciation-Amortization'!$C$1:$W$2,2,FALSE),0)","v":0},{"$f":"IF(E$1-$B6='2. Inputs'!$E$54,-HLOOKUP('Depreciation-Amortization'!$B6,'Depreciation-Amortization'!$C$1:$W$2,2,FALSE),0)","v":0},{"$f":"IF(F$1-$B6='2. Inputs'!$E$54,-HLOOKUP('Depreciation-Amortization'!$B6,'Depreciation-Amortization'!$C$1:$W$2,2,FALSE),0)","v":0},{"$f":"IF(G$1-$B6='2. Inputs'!$E$54,-HLOOKUP('Depreciation-Amortization'!$B6,'Depreciation-Amortization'!$C$1:$W$2,2,FALSE),0)","v":0},{"$f":"IF(H$1-$B6='2. Inputs'!$E$54,-HLOOKUP('Depreciation-Amortization'!$B6,'Depreciation-Amortization'!$C$1:$W$2,2,FALSE),0)","v":0},{"$f":"IF(I$1-$B6='2. Inputs'!$E$54,-HLOOKUP('Depreciation-Amortization'!$B6,'Depreciation-Amortization'!$C$1:$W$2,2,FALSE),0)","v":0},{"$f":"IF(J$1-$B6='2. Inputs'!$E$54,-HLOOKUP('Depreciation-Amortization'!$B6,'Depreciation-Amortization'!$C$1:$W$2,2,FALSE),0)","v":0},{"$f":"IF(K$1-$B6='2. Inputs'!$E$54,-HLOOKUP('Depreciation-Amortization'!$B6,'Depreciation-Amortization'!$C$1:$W$2,2,FALSE),0)","v":0},{"$f":"IF(L$1-$B6='2. Inputs'!$E$54,-HLOOKUP('Depreciation-Amortization'!$B6,'Depreciation-Amortization'!$C$1:$W$2,2,FALSE),0)","v":0},{"$f":"IF(M$1-$B6='2. Inputs'!$E$54,-HLOOKUP('Depreciation-Amortization'!$B6,'Depreciation-Amortization'!$C$1:$W$2,2,FALSE),0)","v":0},{"$f":"IF(N$1-$B6='2. Inputs'!$E$54,-HLOOKUP('Depreciation-Amortization'!$B6,'Depreciation-Amortization'!$C$1:$W$2,2,FALSE),0)","v":0},{"$f":"IF(O$1-$B6='2. Inputs'!$E$54,-HLOOKUP('Depreciation-Amortization'!$B6,'Depreciation-Amortization'!$C$1:$W$2,2,FALSE),0)","v":0},{"$f":"IF(P$1-$B6='2. Inputs'!$E$54,-HLOOKUP('Depreciation-Amortization'!$B6,'Depreciation-Amortization'!$C$1:$W$2,2,FALSE),0)","v":0},{"$f":"IF(Q$1-$B6='2. Inputs'!$E$54,-HLOOKUP('Depreciation-Amortization'!$B6,'Depreciation-Amortization'!$C$1:$W$2,2,FALSE),0)","v":0},{"$f":"IF(R$1-$B6='2. Inputs'!$E$54,-HLOOKUP('Depreciation-Amortization'!$B6,'Depreciation-Amortization'!$C$1:$W$2,2,FALSE),0)","v":0},{"$f":"IF(S$1-$B6='2. Inputs'!$E$54,-HLOOKUP('Depreciation-Amortization'!$B6,'Depreciation-Amortization'!$C$1:$W$2,2,FALSE),0)","v":0},{"$f":"IF(T$1-$B6='2. Inputs'!$E$54,-HLOOKUP('Depreciation-Amortization'!$B6,'Depreciation-Amortization'!$C$1:$W$2,2,FALSE),0)","v":0},{"$f":"IF(U$1-$B6='2. Inputs'!$E$54,-HLOOKUP('Depreciation-Amortization'!$B6,'Depreciation-Amortization'!$C$1:$W$2,2,FALSE),0)","v":0},{"$f":"IF(V$1-$B6='2. Inputs'!$E$54,-HLOOKUP('Depreciation-Amortization'!$B6,'Depreciation-Amortization'!$C$1:$W$2,2,FALSE),0)","v":0},{"$f":"IF(W$1-$B6='2. Inputs'!$E$54,-HLOOKUP('Depreciation-Amortization'!$B6,'Depreciation-Amortization'!$C$1:$W$2,2,FALSE),0)","v":0}]
[null,4,{"$f":"IF(C$1-$B7='2. Inputs'!$E$54,-HLOOKUP('Depreciation-Amortization'!$B7,'Depreciation-Amortization'!$C$1:$W$2,2,FALSE),0)","v":0},{"$f":"IF(D$1-$B7='2. Inputs'!$E$54,-HLOOKUP('Depreciation-Amortization'!$B7,'Depreciation-Amortization'!$C$1:$W$2,2,FALSE),0)","v":0},{"$f":"IF(E$1-$B7='2. Inputs'!$E$54,-HLOOKUP('Depreciation-Amortization'!$B7,'Depreciation-Amortization'!$C$1:$W$2,2,FALSE),0)","v":0},{"$f":"IF(F$1-$B7='2. Inputs'!$E$54,-HLOOKUP('Depreciation-Amortization'!$B7,'Depreciation-Amortization'!$C$1:$W$2,2,FALSE),0)","v":0},{"$f":"IF(G$1-$B7='2. Inputs'!$E$54,-HLOOKUP('Depreciation-Amortization'!$B7,'Depreciation-Amortization'!$C$1:$W$2,2,FALSE),0)","v":0},{"$f":"IF(H$1-$B7='2. Inputs'!$E$54,-HLOOKUP('Depreciation-Amortization'!$B7,'Depreciation-Amortization'!$C$1:$W$2,2,FALSE),0)","v":0},{"$f":"IF(I$1-$B7='2. Inputs'!$E$54,-HLOOKUP('Depreciation-Amortization'!$B7,'Depreciation-Amortization'!$C$1:$W$2,2,FALSE),0)","v":0},{"$f":"IF(J$1-$B7='2. Inputs'!$E$54,-HLOOKUP('Depreciation-Amortization'!$B7,'Depreciation-Amortization'!$C$1:$W$2,2,FALSE),0)","v":0},{"$f":"IF(K$1-$B7='2. Inputs'!$E$54,-HLOOKUP('Depreciation-Amortization'!$B7,'Depreciation-Amortization'!$C$1:$W$2,2,FALSE),0)","v":0},{"$f":"IF(L$1-$B7='2. Inputs'!$E$54,-HLOOKUP('Depreciation-Amortization'!$B7,'Depreciation-Amortization'!$C$1:$W$2,2,FALSE),0)","v":0},{"$f":"IF(M$1-$B7='2. Inputs'!$E$54,-HLOOKUP('Depreciation-Amortization'!$B7,'Depreciation-Amortization'!$C$1:$W$2,2,FALSE),0)","v":0},{"$f":"IF(N$1-$B7='2. Inputs'!$E$54,-HLOOKUP('Depreciation-Amortization'!$B7,'Depreciation-Amortization'!$C$1:$W$2,2,FALSE),0)","v":0},{"$f":"IF(O$1-$B7='2. Inputs'!$E$54,-HLOOKUP('Depreciation-Amortization'!$B7,'Depreciation-Amortization'!$C$1:$W$2,2,FALSE),0)","v":0},{"$f":"IF(P$1-$B7='2. Inputs'!$E$54,-HLOOKUP('Depreciation-Amortization'!$B7,'Depreciation-Amortization'!$C$1:$W$2,2,FALSE),0)","v":0},{"$f":"IF(Q$1-$B7='2. Inputs'!$E$54,-HLOOKUP('Depreciation-Amortization'!$B7,'Depreciation-Amortization'!$C$1:$W$2,2,FALSE),0)","v":0},{"$f":"IF(R$1-$B7='2. Inputs'!$E$54,-HLOOKUP('Depreciation-Amortization'!$B7,'Depreciation-Amortization'!$C$1:$W$2,2,FALSE),0)","v":0},{"$f":"IF(S$1-$B7='2. Inputs'!$E$54,-HLOOKUP('Depreciation-Amortization'!$B7,'Depreciation-Amortization'!$C$1:$W$2,2,FALSE),0)","v":0},{"$f":"IF(T$1-$B7='2. Inputs'!$E$54,-HLOOKUP('Depreciation-Amortization'!$B7,'Depreciation-Amortization'!$C$1:$W$2,2,FALSE),0)","v":0},{"$f":"IF(U$1-$B7='2. Inputs'!$E$54,-HLOOKUP('Depreciation-Amortization'!$B7,'Depreciation-Amortization'!$C$1:$W$2,2,FALSE),0)","v":0},{"$f":"IF(V$1-$B7='2. Inputs'!$E$54,-HLOOKUP('Depreciation-Amortization'!$B7,'Depreciation-Amortization'!$C$1:$W$2,2,FALSE),0)","v":0},{"$f":"IF(W$1-$B7='2. Inputs'!$E$54,-HLOOKUP('Depreciation-Amortization'!$B7,'Depreciation-Amortization'!$C$1:$W$2,2,FALSE),0)","v":0}]
[null,5,{"$f":"IF(C$1-$B8='2. Inputs'!$E$54,-HLOOKUP('Depreciation-Amortization'!$B8,'Depreciation-Amortization'!$C$1:$W$2,2,FALSE),0)","v":0},{"$f":"IF(D$1-$B8='2. Inputs'!$E$54,-HLOOKUP('Depreciation-Amortization'!$B8,'Depreciation-Amortization'!$C$1:$W$2,2,FALSE),0)","v":0},{"$f":"IF(E$1-$B8='2. Inputs'!$E$54,-HLOOKUP('Depreciation-Amortization'!$B8,'Depreciation-Amortization'!$C$1:$W$2,2,FALSE),0)","v":0},{"$f":"IF(F$1-$B8='2. Inputs'!$E$54,-HLOOKUP('Depreciation-Amortization'!$B8,'Depreciation-Amortization'!$C$1:$W$2,2,FALSE),0)","v":0},{"$f":"IF(G$1-$B8='2. Inputs'!$E$54,-HLOOKUP('Depreciation-Amortization'!$B8,'Depreciation-Amortization'!$C$1:$W$2,2,FALSE),0)","v":0},{"$f":"IF(H$1-$B8='2. Inputs'!$E$54,-HLOOKUP('Depreciation-Amortization'!$B8,'Depreciation-Amortization'!$C$1:$W$2,2,FALSE),0)","v":0},{"$f":"IF(I$1-$B8='2. Inputs'!$E$54,-HLOOKUP('Depreciation-Amortization'!$B8,'Depreciation-Amortization'!$C$1:$W$2,2,FALSE),0)","v":0},{"$f":"IF(J$1-$B8='2. Inputs'!$E$54,-HLOOKUP('Depreciation-Amortization'!$B8,'Depreciation-Amortization'!$C$1:$W$2,2,FALSE),0)","v":0},{"$f":"IF(K$1-$B8='2. Inputs'!$E$54,-HLOOKUP('Depreciation-Amortization'!$B8,'Depreciation-Amortization'!$C$1:$W$2,2,FALSE),0)","v":0},{"$f":"IF(L$1-$B8='2. Inputs'!$E$54,-HLOOKUP('Depreciation-Amortization'!$B8,'Depreciation-Amortization'!$C$1:$W$2,2,FALSE),0)","v":0},{"$f":"IF(M$1-$B8='2. Inputs'!$E$54,-HLOOKUP('Depreciation-Amortization'!$B8,'Depreciation-Amortization'!$C$1:$W$2,2,FALSE),0)","v":0},{"$f":"IF(N$1-$B8='2. Inputs'!$E$54,-HLOOKUP('Depreciation-Amortization'!$B8,'Depreciation-Amortization'!$C$1:$W$2,2,FALSE),0)","v":0},{"$f":"IF(O$1-$B8='2. Inputs'!$E$54,-HLOOKUP('Depreciation-Amortization'!$B8,'Depreciation-Amortization'!$C$1:$W$2,2,FALSE),0)","v":0},{"$f":"IF(P$1-$B8='2. Inputs'!$E$54,-HLOOKUP('Depreciation-Amortization'!$B8,'Depreciation-Amortization'!$C$1:$W$2,2,FALSE),0)","v":0},{"$f":"IF(Q$1-$B8='2. Inputs'!$E$54,-HLOOKUP('Depreciation-Amortization'!$B8,'Depreciation-Amortization'!$C$1:$W$2,2,FALSE),0)","v":0},{"$f":"IF(R$1-$B8='2. Inputs'!$E$54,-HLOOKUP('Depreciation-Amortization'!$B8,'Depreciation-Amortization'!$C$1:$W$2,2,FALSE),0)","v":0},{"$f":"IF(S$1-$B8='2. Inputs'!$E$54,-HLOOKUP('Depreciation-Amortization'!$B8,'Depreciation-Amortization'!$C$1:$W$2,2,FALSE),0)","v":0},{"$f":"IF(T$1-$B8='2. Inputs'!$E$54,-HLOOKUP('Depreciation-Amortization'!$B8,'Depreciation-Amortization'!$C$1:$W$2,2,FALSE),0)","v":0},{"$f":"IF(U$1-$B8='2. Inputs'!$E$54,-HLOOKUP('Depreciation-Amortization'!$B8,'Depreciation-Amortization'!$C$1:$W$2,2,FALSE),0)","v":0},{"$f":"IF(V$1-$B8='2. Inputs'!$E$54,-HLOOKUP('Depreciation-Amortization'!$B8,'Depreciation-Amortization'!$C$1:$W$2,2,FALSE),0)","v":0},{"$f":"IF(W$1-$B8='2. Inputs'!$E$54,-HLOOKUP('Depreciation-Amortization'!$B8,'Depreciation-Amortization'!$C$1:$W$2,2,FALSE),0)","v":0}]
{"$rows_left_out":43}
{"sheet":"Data summary","index":6,"n_rows":32,"n_cols":16,"rows_kept":32,"cut":false,"hidden":true,"merged":[]}
[]
[]
[]
[]
[]
[]
[]
[]
{"$rows_left_out":24}